Page MenuHomePhabricator

[seeder] Use testutil library in seeder tests
ClosedPublic

Authored by deadalnix on Sun, Jun 28, 18:19.

Details

Reviewers
Fabien
Group Reviewers
Restricted Project
Commits
rABC7efd78f59e4e: [seeder] Use testutil library in seeder tests
Summary

As per title.

Depends on D6759

Test Plan
ninja all check-seeder

Diff Detail

Repository
rABC Bitcoin ABC
Lint
Automatic diff as part of commit; lint not applicable.
Unit
Automatic diff as part of commit; unit tests not applicable.

Event Timeline

deadalnix created this revision.Sun, Jun 28, 18:19
Herald added a reviewer: Restricted Project. · View Herald TranscriptSun, Jun 28, 18:19
deadalnix requested review of this revision.Sun, Jun 28, 18:19

Snippet of first build failure:

[18:28:44] :	 [Step 1/1] [28/82] Linking CXX executable src/leveldb/arena_test
[18:28:44] :	 [Step 1/1] [29/82] Linking CXX executable src/leveldb/crc32c_test
[18:28:44] :	 [Step 1/1] [30/82] Linking CXX executable src/leveldb/write_batch_test
[18:28:44] :	 [Step 1/1] [31/82] Linking CXX executable src/leveldb/issue178_test
[18:28:44] :	 [Step 1/1] [32/82] leveldb: testing env_posix_test
[18:28:44] :	 [Step 1/1] [33/82] Building CXX object src/leveldb/CMakeFiles/autocompact_test.dir/db/autocompact_test.cc.o
[18:28:44] :	 [Step 1/1] [34/82] Building CXX object src/leveldb/CMakeFiles/version_edit_test.dir/db/version_edit_test.cc.o
[18:28:44] :	 [Step 1/1] [35/82] Linking CXX executable src/leveldb/autocompact_test
[18:28:44] :	 [Step 1/1] [36/82] Linking CXX executable src/leveldb/version_edit_test
[18:28:44] :	 [Step 1/1] [37/82] leveldb: testing c_test
[18:28:44] :	 [Step 1/1] [38/82] leveldb: testing cache_test
[18:28:44] :	 [Step 1/1] [39/82] leveldb: testing dbformat_test
[18:28:44] :	 [Step 1/1] [40/82] leveldb: testing coding_test
[18:28:44] :	 [Step 1/1] [41/82] leveldb: testing hash_test
[18:28:44] :	 [Step 1/1] [42/82] leveldb: testing bloom_test
[18:28:44] :	 [Step 1/1] [43/82] leveldb: testing env_test
[18:28:44] :	 [Step 1/1] [44/82] leveldb: testing version_edit_test
[18:28:44] :	 [Step 1/1] [45/82] Building CXX object src/leveldb/CMakeFiles/log_test.dir/db/log_test.cc.o
[18:28:44] :	 [Step 1/1] [46/82] leveldb: testing filename_test
[18:28:44] :	 [Step 1/1] [47/82] leveldb: testing crc32c_test
[18:28:44] :	 [Step 1/1] [48/82] Linking CXX executable src/leveldb/log_test
[18:28:44] :	 [Step 1/1] [49/82] leveldb: testing write_batch_test
[18:28:44] :	 [Step 1/1] [50/82] Building CXX object src/leveldb/CMakeFiles/memenv_test.dir/helpers/memenv/memenv_test.cc.o
[18:28:44] :	 [Step 1/1] [51/82] leveldb: testing log_test
[18:28:44] :	 [Step 1/1] [52/82] Linking CXX executable src/leveldb/memenv_test
[18:28:44] :	 [Step 1/1] [53/82] leveldb: testing memenv_test
[18:28:44] :	 [Step 1/1] [54/82] Building CXX object src/leveldb/CMakeFiles/issue200_test.dir/issues/issue200_test.cc.o
[18:28:44] :	 [Step 1/1] [55/82] Linking CXX executable src/leveldb/issue200_test
[18:28:44] :	 [Step 1/1] [56/82] leveldb: testing issue200_test
[18:28:44] :	 [Step 1/1] [57/82] Building CXX object src/leveldb/CMakeFiles/table_test.dir/table/table_test.cc.o
[18:28:44] :	 [Step 1/1] [58/82] Building CXX object src/leveldb/CMakeFiles/filter_block_test.dir/table/filter_block_test.cc.o
[18:28:44] :	 [Step 1/1] [59/82] Linking CXX executable src/leveldb/table_test
[18:28:44] :	 [Step 1/1] [60/82] Linking CXX executable src/leveldb/filter_block_test
[18:28:44] :	 [Step 1/1] [61/82] leveldb: testing filter_block_test
[18:28:44] :	 [Step 1/1] [62/82] Building CXX object src/leveldb/CMakeFiles/corruption_test.dir/db/corruption_test.cc.o
[18:28:44] :	 [Step 1/1] [63/82] Building CXX object src/leveldb/CMakeFiles/fault_injection_test.dir/db/fault_injection_test.cc.o
[18:28:44] :	 [Step 1/1] [64/82] Linking CXX executable src/leveldb/corruption_test
[18:28:44] :	 [Step 1/1] [65/82] leveldb: testing skiplist_test
[18:28:44] :	 [Step 1/1] [66/82] Linking CXX executable src/leveldb/fault_injection_test
[18:28:44] :	 [Step 1/1] [67/82] leveldb: testing arena_test
[18:28:44] :	 [Step 1/1] [68/82] Building CXX object src/leveldb/CMakeFiles/version_set_test.dir/db/version_set_test.cc.o
[18:28:44] :	 [Step 1/1] [69/82] leveldb: testing fault_injection_test
[18:28:44] :	 [Step 1/1] [70/82] Linking CXX executable src/leveldb/version_set_test
[18:28:44] :	 [Step 1/1] [71/82] leveldb: testing version_set_test
[18:28:44] :	 [Step 1/1] [72/82] leveldb: testing corruption_test
[18:28:44] :	 [Step 1/1] [73/82] Building CXX object src/leveldb/CMakeFiles/recovery_test.dir/db/recovery_test.cc.o
[18:28:44] :	 [Step 1/1] [74/82] Linking CXX executable src/leveldb/recovery_test
[18:28:44] :	 [Step 1/1] [75/82] leveldb: testing recovery_test
[18:28:44] :	 [Step 1/1] [76/82] leveldb: testing table_test
[18:28:44] :	 [Step 1/1] [77/82] leveldb: testing issue178_test
[18:28:44] :	 [Step 1/1] [78/82] Building CXX object src/leveldb/CMakeFiles/db_test.dir/db/db_test.cc.o
[18:28:44] :	 [Step 1/1] [79/82] Linking CXX executable src/leveldb/db_test
[18:28:44] :	 [Step 1/1] [80/82] leveldb: testing autocompact_test
[18:28:44] :	 [Step 1/1] [81/82] leveldb: testing db_test
[18:28:44] :	 [Step 1/1] [82/82] Running leveldb test suite
[18:28:44] :	 [Step 1/1] PASSED: leveldb test suite
[18:28:44] :	 [Step 1/1] ninja: error: unknown target 'check-bitcoin-seeder'
[18:28:44] :	 [Step 1/1] Build build-diff failed with exit code 1
[18:29:17]W:	 [Step 1/1] Process exited with code 1
[18:29:17]E:	 [Step 1/1] Process exited with code 1 (Step: Command Line)

Snippet of first build failure:

[18:30:19] :	 [Step 1/1] [420/463] Linking CXX executable src/bench/bitcoin-bench
[18:30:19] :	 [Step 1/1] [421/463] Building CXX object src/qt/CMakeFiles/bitcoin-qt-base.dir/optionsdialog.cpp.o
[18:30:19] :	 [Step 1/1] [422/463] Building CXX object src/qt/CMakeFiles/bitcoin-qt-base.dir/optionsmodel.cpp.o
[18:30:19] :	 [Step 1/1] [423/463] Building CXX object src/qt/CMakeFiles/bitcoin-qt-base.dir/bitcoingui.cpp.o
[18:30:19] :	 [Step 1/1] [424/463] Building CXX object src/qt/CMakeFiles/bitcoin-qt-base.dir/guiutil.cpp.o
[18:30:19] :	 [Step 1/1] [425/463] Building CXX object src/qt/CMakeFiles/bitcoin-qt-base.dir/peertablemodel.cpp.o
[18:30:19] :	 [Step 1/1] [426/463] Building CXX object src/qt/CMakeFiles/bitcoin-qt-base.dir/trafficgraphwidget.cpp.o
[18:30:19] :	 [Step 1/1] [427/463] Building CXX object src/qt/CMakeFiles/bitcoin-qt-base.dir/addressbookpage.cpp.o
[18:30:19] :	 [Step 1/1] [428/463] Building CXX object src/qt/CMakeFiles/bitcoin-qt-base.dir/coincontroltreewidget.cpp.o
[18:30:19] :	 [Step 1/1] [429/463] Building CXX object src/qt/CMakeFiles/bitcoin-qt-base.dir/utilitydialog.cpp.o
[18:30:19] :	 [Step 1/1] [430/463] Building CXX object src/qt/CMakeFiles/bitcoin-qt-base.dir/splashscreen.cpp.o
[18:30:19] :	 [Step 1/1] [431/463] Building CXX object src/qt/CMakeFiles/bitcoin-qt-base.dir/editaddressdialog.cpp.o
[18:30:19] :	 [Step 1/1] [432/463] Building CXX object src/qt/CMakeFiles/bitcoin-qt-base.dir/askpassphrasedialog.cpp.o
[18:30:19] :	 [Step 1/1] [433/463] Building CXX object src/qt/CMakeFiles/bitcoin-qt-base.dir/openuridialog.cpp.o
[18:30:19] :	 [Step 1/1] [434/463] Building CXX object src/qt/CMakeFiles/bitcoin-qt-base.dir/overviewpage.cpp.o
[18:30:19] :	 [Step 1/1] [435/463] Building CXX object src/qt/CMakeFiles/bitcoin-qt-base.dir/qrc_bitcoin_locale.cpp.o
[18:30:19] :	 [Step 1/1] [436/463] Building CXX object src/qt/CMakeFiles/bitcoin-qt-base.dir/addresstablemodel.cpp.o
[18:30:19] :	 [Step 1/1] [437/463] Building CXX object src/qt/CMakeFiles/bitcoin-qt-base.dir/receiverequestdialog.cpp.o
[18:30:19] :	 [Step 1/1] [438/463] Building CXX object src/qt/CMakeFiles/bitcoin-qt-base.dir/transactiondescdialog.cpp.o
[18:30:19] :	 [Step 1/1] [439/463] Building CXX object src/qt/CMakeFiles/bitcoin-qt-base.dir/recentrequeststablemodel.cpp.o
[18:30:19] :	 [Step 1/1] [440/463] Building CXX object src/qt/CMakeFiles/bitcoin-qt-base.dir/transactionfilterproxy.cpp.o
[18:30:19] :	 [Step 1/1] [441/463] Building CXX object src/qt/CMakeFiles/bitcoin-qt-base.dir/sendcoinsentry.cpp.o
[18:30:19] :	 [Step 1/1] [442/463] Building CXX object src/qt/CMakeFiles/bitcoin-qt-base.dir/receivecoinsdialog.cpp.o
[18:30:19] :	 [Step 1/1] [443/463] Building CXX object src/qt/CMakeFiles/bitcoin-qt-base.dir/rpcconsole.cpp.o
[18:30:19] :	 [Step 1/1] [444/463] Building CXX object src/qt/CMakeFiles/bitcoin-qt-base.dir/coincontroldialog.cpp.o
[18:30:19] :	 [Step 1/1] [445/463] Building CXX object src/qt/CMakeFiles/bitcoin-qt-base.dir/paymentserver.cpp.o
[18:30:19] :	 [Step 1/1] [446/463] Building CXX object src/qt/CMakeFiles/bitcoin-qt-base.dir/transactionrecord.cpp.o
[18:30:19] :	 [Step 1/1] [447/463] Building CXX object src/qt/CMakeFiles/bitcoin-qt-base.dir/signverifymessagedialog.cpp.o
[18:30:19] :	 [Step 1/1] [448/463] Building CXX object src/qt/CMakeFiles/bitcoin-qt-base.dir/transactiondesc.cpp.o
[18:30:19] :	 [Step 1/1] [449/463] Building CXX object src/qt/CMakeFiles/bitcoin-qt-base.dir/walletframe.cpp.o
[18:30:19] :	 [Step 1/1] [450/463] Building CXX object src/qt/CMakeFiles/bitcoin-qt-base.dir/transactionview.cpp.o
[18:30:19] :	 [Step 1/1] [451/463] Building CXX object src/qt/CMakeFiles/bitcoin-qt-base.dir/walletmodeltransaction.cpp.o
[18:30:19] :	 [Step 1/1] [452/463] Building CXX object src/qt/CMakeFiles/bitcoin-qt-base.dir/walletcontroller.cpp.o
[18:30:19] :	 [Step 1/1] [453/463] Building CXX object src/qt/CMakeFiles/bitcoin-qt-base.dir/transactiontablemodel.cpp.o
[18:30:19] :	 [Step 1/1] [454/463] Building CXX object src/qt/CMakeFiles/bitcoin-qt-base.dir/paymentrequestplus.cpp.o
[18:30:19] :	 [Step 1/1] [455/463] Building CXX object src/qt/CMakeFiles/bitcoin-qt-base.dir/sendcoinsdialog.cpp.o
[18:30:19] :	 [Step 1/1] [456/463] Building CXX object src/qt/CMakeFiles/bitcoin-qt-base.dir/walletview.cpp.o
[18:30:19] :	 [Step 1/1] [457/463] Building CXX object src/qt/CMakeFiles/bitcoin-qt-base.dir/walletmodel.cpp.o
[18:30:19] :	 [Step 1/1] [458/463] Building CXX object src/qt/CMakeFiles/bitcoin-qt-base.dir/bitcoin-qt-base_autogen/mocs_compilation.cpp.o
[18:30:21] :	 [Step 1/1] Publishing artifacts (20s)
[18:30:21] :		 [Publishing artifacts] Collecting files to publish: [+:results/artifacts=>artifacts.tar.gz]
[18:30:21] :		 [Publishing artifacts] Creating archive artifacts.tar.gz (12s)
[18:30:21] :			 [Creating archive artifacts.tar.gz] Creating /home/teamcity/buildAgent/temp/buildTmp/TarPreprocessor3340639633439892563/artifacts.tar.gz
[18:30:21]W:	 [Step 1/1] cp: cannot stat '/tmp/sanitizer_logs': No such file or directory
[18:30:21]W:	 [Step 1/1] cp: cannot stat '/work/build-clang-10': No such file or directory
[18:30:22]W:	 [Step 1/1] cp: cannot stat '/work/ibd/debug.log': No such file or directory
[18:30:34] :			 [Creating archive artifacts.tar.gz] Archive was created, file size 127.11 MB (133293880 bytes)
[18:30:34] :		 [Publishing artifacts] Publishing 1 file using [ArtifactsCachePublisher]: results/artifacts => artifacts.tar.gz
[18:30:34] :		 [Publishing artifacts] Publishing 1 file using [WebPublisher]: results/artifacts => artifacts.tar.gz
[18:30:21] :	 [Step 1/1] [459/463] Linking CXX static library src/qt/libbitcoin-qt-base.a
[18:30:21]i:	 [Step 1/1] ##teamcity[publishArtifacts '+:results/artifacts=>artifacts.tar.gz']
[18:30:34] :	 [Step 1/1] 
[18:30:34] :	 [Step 1/1] [460/463] Automatic MOC for target bitcoin-qt
[18:30:34] :	 [Step 1/1] [461/463] Building CXX object src/qt/CMakeFiles/bitcoin-qt.dir/bitcoin-qt_autogen/mocs_compilation.cpp.o
[18:30:34] :	 [Step 1/1] [462/463] Building CXX object src/qt/CMakeFiles/bitcoin-qt.dir/main.cpp.o
[18:30:34] :	 [Step 1/1] [463/463] Linking CXX executable src/qt/bitcoin-qt
[18:30:34] :	 [Step 1/1] ninja: error: unknown target 'test_bitcoin-seeder'
[18:30:34] :	 [Step 1/1] Build build-clang-10 failed with exit code 1
[18:30:34]W:	 [Step 1/1] Process exited with code 1
[18:30:42]E:	 [Step 1/1] Process exited with code 1 (Step: Command Line)
deadalnix updated this revision to Diff 21832.Sun, Jun 28, 19:32

Remove seeder tests from the autotool build.

The build is deprecated anyways, autotool dep management is terrible, and the seeder has some strange linking issues to boot, so that makes it all much simpler.

Snippet of first build failure:

[19:33:51] :	 [Step 1/1] [408/463] Building CXX object src/qt/CMakeFiles/bitcoin-qt-base.dir/bantablemodel.cpp.o
[19:33:51] :	 [Step 1/1] [409/463] Building CXX object src/qt/CMakeFiles/bitcoin-qt-base.dir/bitcoinaddressvalidator.cpp.o
[19:33:51] :	 [Step 1/1] [410/463] Building CXX object src/qt/CMakeFiles/bitcoin-qt-base.dir/bitcoinamountfield.cpp.o
[19:33:51] :	 [Step 1/1] [411/463] Building CXX object src/qt/CMakeFiles/bitcoin-qt-base.dir/bitcoingui.cpp.o
[19:33:51] :	 [Step 1/1] [412/463] Building CXX object src/qt/CMakeFiles/bitcoin-qt-base.dir/bitcoinunits.cpp.o
[19:33:51] :	 [Step 1/1] [413/463] Building CXX object src/qt/CMakeFiles/bitcoin-qt-base.dir/clientmodel.cpp.o
[19:33:51] :	 [Step 1/1] [414/463] Building CXX object src/qt/CMakeFiles/bitcoin-qt-base.dir/csvmodelwriter.cpp.o
[19:33:51] :	 [Step 1/1] [415/463] Building CXX object src/qt/CMakeFiles/bitcoin-qt-base.dir/guiutil.cpp.o
[19:33:51] :	 [Step 1/1] [416/463] Building CXX object src/qt/CMakeFiles/bitcoin-qt-base.dir/intro.cpp.o
[19:33:51] :	 [Step 1/1] [417/463] Building CXX object src/qt/CMakeFiles/bitcoin-qt-base.dir/networkstyle.cpp.o
[19:33:51] :	 [Step 1/1] [418/463] Building CXX object src/qt/CMakeFiles/bitcoin-qt-base.dir/notificator.cpp.o
[19:33:51] :	 [Step 1/1] [419/463] Building CXX object src/qt/CMakeFiles/bitcoin-qt-base.dir/optionsdialog.cpp.o
[19:33:51] :	 [Step 1/1] [420/463] Building CXX object src/qt/CMakeFiles/bitcoin-qt-base.dir/qvalidatedlineedit.cpp.o
[19:33:51] :	 [Step 1/1] [421/463] Building CXX object src/qt/CMakeFiles/bitcoin-qt-base.dir/qvaluecombobox.cpp.o
[19:33:51] :	 [Step 1/1] [422/463] Building CXX object src/qt/CMakeFiles/bitcoin-qt-base.dir/platformstyle.cpp.o
[19:33:51] :	 [Step 1/1] [423/463] Building CXX object src/qt/CMakeFiles/bitcoin-qt-base.dir/peertablemodel.cpp.o
[19:33:51] :	 [Step 1/1] [424/463] Building CXX object src/qt/CMakeFiles/bitcoin-qt-base.dir/coincontroltreewidget.cpp.o
[19:33:51] :	 [Step 1/1] [425/463] Building CXX object src/qt/CMakeFiles/bitcoin-qt-base.dir/optionsmodel.cpp.o
[19:33:51] :	 [Step 1/1] [426/463] Building CXX object src/qt/CMakeFiles/bitcoin-qt-base.dir/trafficgraphwidget.cpp.o
[19:33:51] :	 [Step 1/1] [427/463] Building CXX object src/qt/CMakeFiles/bitcoin-qt-base.dir/addressbookpage.cpp.o
[19:33:51] :	 [Step 1/1] [428/463] Building CXX object src/qt/CMakeFiles/bitcoin-qt-base.dir/splashscreen.cpp.o
[19:33:51] :	 [Step 1/1] [429/463] Building CXX object src/qt/CMakeFiles/bitcoin-qt-base.dir/utilitydialog.cpp.o
[19:33:51] :	 [Step 1/1] [430/463] Building CXX object src/qt/CMakeFiles/bitcoin-qt-base.dir/editaddressdialog.cpp.o
[19:33:51] :	 [Step 1/1] [431/463] Building CXX object src/qt/CMakeFiles/bitcoin-qt-base.dir/rpcconsole.cpp.o
[19:33:51] :	 [Step 1/1] [432/463] Building CXX object src/qt/CMakeFiles/bitcoin-qt-base.dir/askpassphrasedialog.cpp.o
[19:33:51] :	 [Step 1/1] [433/463] Building CXX object src/qt/CMakeFiles/bitcoin-qt-base.dir/addresstablemodel.cpp.o
[19:33:51] :	 [Step 1/1] [434/463] Building CXX object src/qt/CMakeFiles/bitcoin-qt-base.dir/coincontroldialog.cpp.o
[19:33:51] :	 [Step 1/1] [435/463] Building CXX object src/qt/CMakeFiles/bitcoin-qt-base.dir/openuridialog.cpp.o
[19:33:51] :	 [Step 1/1] [436/463] Building CXX object src/qt/CMakeFiles/bitcoin-qt-base.dir/overviewpage.cpp.o
[19:33:51] :	 [Step 1/1] [437/463] Building CXX object src/qt/CMakeFiles/bitcoin-qt-base.dir/recentrequeststablemodel.cpp.o
[19:33:51] :	 [Step 1/1] [438/463] Building CXX object src/qt/CMakeFiles/bitcoin-qt-base.dir/paymentserver.cpp.o
[19:33:51] :	 [Step 1/1] [439/463] Building CXX object src/qt/CMakeFiles/bitcoin-qt-base.dir/receivecoinsdialog.cpp.o
[19:33:51] :	 [Step 1/1] [440/463] Building CXX object src/qt/CMakeFiles/bitcoin-qt-base.dir/receiverequestdialog.cpp.o
[19:33:51] :	 [Step 1/1] [441/463] Building CXX object src/qt/CMakeFiles/bitcoin-qt-base.dir/transactiondescdialog.cpp.o
[19:33:51] :	 [Step 1/1] [442/463] Building CXX object src/qt/CMakeFiles/bitcoin-qt-base.dir/transactionfilterproxy.cpp.o
[19:33:51] :	 [Step 1/1] [443/463] Building CXX object src/qt/CMakeFiles/bitcoin-qt-base.dir/sendcoinsentry.cpp.o
[19:33:51] :	 [Step 1/1] [444/463] Building CXX object src/qt/CMakeFiles/bitcoin-qt-base.dir/sendcoinsdialog.cpp.o
[19:33:51] :	 [Step 1/1] [445/463] Building CXX object src/qt/CMakeFiles/bitcoin-qt-base.dir/signverifymessagedialog.cpp.o
[19:33:51] :	 [Step 1/1] [446/463] Building CXX object src/qt/CMakeFiles/bitcoin-qt-base.dir/transactiondesc.cpp.o
[19:33:51] :	 [Step 1/1] [447/463] Building CXX object src/qt/CMakeFiles/bitcoin-qt-base.dir/transactionrecord.cpp.o
[19:33:51] :	 [Step 1/1] [448/463] Building CXX object src/qt/CMakeFiles/bitcoin-qt-base.dir/walletframe.cpp.o
[19:33:51] :	 [Step 1/1] [449/463] Building CXX object src/qt/CMakeFiles/bitcoin-qt-base.dir/transactiontablemodel.cpp.o
[19:33:51] :	 [Step 1/1] [450/463] Building CXX object src/qt/CMakeFiles/bitcoin-qt-base.dir/transactionview.cpp.o
[19:33:51] :	 [Step 1/1] [451/463] Building CXX object src/qt/CMakeFiles/bitcoin-qt-base.dir/walletcontroller.cpp.o
[19:33:51] :	 [Step 1/1] [452/463] Building CXX object src/qt/CMakeFiles/bitcoin-qt-base.dir/walletmodeltransaction.cpp.o
[19:33:51] :	 [Step 1/1] [453/463] Building CXX object src/qt/CMakeFiles/bitcoin-qt-base.dir/paymentrequestplus.cpp.o
[19:33:51] :	 [Step 1/1] [454/463] Building CXX object src/qt/CMakeFiles/bitcoin-qt-base.dir/walletmodel.cpp.o
[19:33:51] :	 [Step 1/1] [455/463] Building CXX object src/qt/CMakeFiles/bitcoin-qt-base.dir/walletview.cpp.o
[19:33:51] :	 [Step 1/1] [456/463] Building CXX object src/qt/CMakeFiles/bitcoin-qt-base.dir/bitcoin-qt-base_autogen/mocs_compilation.cpp.o
[19:33:51] :	 [Step 1/1] [457/463] Building CXX object src/qt/CMakeFiles/bitcoin-qt-base.dir/qrc_bitcoin.cpp.o
[19:33:51] :	 [Step 1/1] [458/463] Building CXX object src/qt/CMakeFiles/bitcoin-qt-base.dir/qrc_bitcoin_locale.cpp.o
[19:33:51] :	 [Step 1/1] [459/463] Linking CXX static library src/qt/libbitcoin-qt-base.a
[19:33:51] :	 [Step 1/1] [460/463] Automatic MOC for target bitcoin-qt
[19:33:51] :	 [Step 1/1] [461/463] Building CXX object src/qt/CMakeFiles/bitcoin-qt.dir/bitcoin-qt_autogen/mocs_compilation.cpp.o
[19:33:51] :	 [Step 1/1] [462/463] Building CXX object src/qt/CMakeFiles/bitcoin-qt.dir/main.cpp.o
[19:33:51] :	 [Step 1/1] [463/463] Linking CXX executable src/qt/bitcoin-qt
[19:33:51] :	 [Step 1/1] ninja: error: unknown target 'test_bitcoin-seeder'
[19:33:51] :	 [Step 1/1] Build build-clang-10 failed with exit code 1
[19:33:51]W:	 [Step 1/1] Process exited with code 1
[19:33:56]E:	 [Step 1/1] Process exited with code 1 (Step: Command Line)

Snippet of first build failure:

[19:37:00] :	 [Step 1/1] [28/82] Building CXX object src/leveldb/CMakeFiles/version_set_test.dir/db/version_set_test.cc.o
[19:37:00] :	 [Step 1/1] [29/82] Linking CXX static library src/leveldb/libleveldb_test_base.a
[19:37:00] :	 [Step 1/1] [30/82] Linking CXX executable src/leveldb/hash_test
[19:37:00] :	 [Step 1/1] [31/82] Linking CXX executable src/leveldb/bloom_test
[19:37:00] :	 [Step 1/1] [32/82] Linking CXX executable src/leveldb/skiplist_test
[19:37:00] :	 [Step 1/1] [33/82] Linking CXX executable src/leveldb/filename_test
[19:37:00] :	 [Step 1/1] [34/82] Linking CXX executable src/leveldb/dbformat_test
[19:37:00] :	 [Step 1/1] [35/82] Linking CXX executable src/leveldb/cache_test
[19:37:00] :	 [Step 1/1] [36/82] Linking CXX executable src/leveldb/log_test
[19:37:00] :	 [Step 1/1] [37/82] Linking CXX executable src/leveldb/coding_test
[19:37:00] :	 [Step 1/1] [38/82] Linking CXX executable src/leveldb/env_posix_test
[19:37:00] :	 [Step 1/1] [39/82] Linking CXX executable src/leveldb/env_test
[19:37:00] :	 [Step 1/1] [40/82] Linking CXX executable src/leveldb/arena_test
[19:37:00] :	 [Step 1/1] [41/82] Linking CXX executable src/leveldb/crc32c_test
[19:37:00] :	 [Step 1/1] [42/82] Linking CXX executable src/leveldb/memenv_test
[19:37:00] :	 [Step 1/1] [43/82] Linking CXX executable src/leveldb/c_test
[19:37:00] :	 [Step 1/1] [44/82] Linking CXX executable src/leveldb/table_test
[19:37:00] :	 [Step 1/1] [45/82] Linking CXX executable src/leveldb/write_batch_test
[19:37:00] :	 [Step 1/1] [46/82] Linking CXX executable src/leveldb/version_set_test
[19:37:00] :	 [Step 1/1] [47/82] Linking CXX executable src/leveldb/version_edit_test
[19:37:00] :	 [Step 1/1] [48/82] leveldb: testing env_posix_test
[19:37:00] :	 [Step 1/1] [49/82] Linking CXX executable src/leveldb/filter_block_test
[19:37:00] :	 [Step 1/1] [50/82] Linking CXX executable src/leveldb/recovery_test
[19:37:00] :	 [Step 1/1] [51/82] Linking CXX executable src/leveldb/db_test
[19:37:00] :	 [Step 1/1] [52/82] Linking CXX executable src/leveldb/autocompact_test
[19:37:00] :	 [Step 1/1] [53/82] Linking CXX executable src/leveldb/corruption_test
[19:37:00] :	 [Step 1/1] [54/82] leveldb: testing cache_test
[19:37:00] :	 [Step 1/1] [55/82] Linking CXX executable src/leveldb/fault_injection_test
[19:37:00] :	 [Step 1/1] [56/82] leveldb: testing dbformat_test
[19:37:00] :	 [Step 1/1] [57/82] leveldb: testing hash_test
[19:37:00] :	 [Step 1/1] [58/82] leveldb: testing memenv_test
[19:37:00] :	 [Step 1/1] [59/82] leveldb: testing version_edit_test
[19:37:00] :	 [Step 1/1] [60/82] leveldb: testing filename_test
[19:37:00] :	 [Step 1/1] [61/82] Linking CXX executable src/leveldb/issue178_test
[19:37:00] :	 [Step 1/1] [62/82] Linking CXX executable src/leveldb/issue200_test
[19:37:00] :	 [Step 1/1] [63/82] leveldb: testing crc32c_test
[19:37:00] :	 [Step 1/1] [64/82] leveldb: testing coding_test
[19:37:00] :	 [Step 1/1] [65/82] leveldb: testing issue200_test
[19:37:00] :	 [Step 1/1] [66/82] leveldb: testing bloom_test
[19:37:00] :	 [Step 1/1] [67/82] leveldb: testing version_set_test
[19:37:00] :	 [Step 1/1] [68/82] leveldb: testing write_batch_test
[19:37:00] :	 [Step 1/1] [69/82] leveldb: testing filter_block_test
[19:37:00] :	 [Step 1/1] [70/82] leveldb: testing c_test
[19:37:00] :	 [Step 1/1] [71/82] leveldb: testing recovery_test
[19:37:00] :	 [Step 1/1] [72/82] leveldb: testing log_test
[19:37:00] :	 [Step 1/1] [73/82] leveldb: testing env_test
[19:37:00] :	 [Step 1/1] [74/82] leveldb: testing corruption_test
[19:37:00] :	 [Step 1/1] [75/82] leveldb: testing fault_injection_test
[19:37:00] :	 [Step 1/1] [76/82] leveldb: testing skiplist_test
[19:37:00] :	 [Step 1/1] [77/82] leveldb: testing arena_test
[19:37:00] :	 [Step 1/1] [78/82] leveldb: testing table_test
[19:37:00] :	 [Step 1/1] [79/82] leveldb: testing issue178_test
[19:37:00] :	 [Step 1/1] [80/82] leveldb: testing autocompact_test
[19:37:00] :	 [Step 1/1] [81/82] leveldb: testing db_test
[19:37:00] :	 [Step 1/1] [82/82] Running leveldb test suite
[19:37:00] :	 [Step 1/1] PASSED: leveldb test suite
[19:37:00] :	 [Step 1/1] ninja: error: unknown target 'check-bitcoin-seeder'
[19:37:00] :	 [Step 1/1] Build build-diff failed with exit code 1
[19:37:37]W:	 [Step 1/1] Process exited with code 1
[19:37:37]E:	 [Step 1/1] Process exited with code 1 (Step: Command Line)
deadalnix updated this revision to Diff 21834.Sun, Jun 28, 19:48

Add fixture for the test suite name

Snippet of first build failure:

[19:50:19] :	 [Step 1/1] [408/463] Building CXX object src/qt/CMakeFiles/bitcoin-qt-base.dir/networkstyle.cpp.o
[19:50:19] :	 [Step 1/1] [409/463] Building CXX object src/qt/CMakeFiles/bitcoin-qt-base.dir/notificator.cpp.o
[19:50:19] :	 [Step 1/1] [410/463] Building CXX object src/qt/CMakeFiles/bitcoin-qt-base.dir/bantablemodel.cpp.o
[19:50:19] :	 [Step 1/1] [411/463] Building CXX object src/qt/CMakeFiles/bitcoin-qt-base.dir/bitcoinaddressvalidator.cpp.o
[19:50:19] :	 [Step 1/1] [412/463] Building CXX object src/qt/CMakeFiles/bitcoin-qt-base.dir/bitcoinamountfield.cpp.o
[19:50:19] :	 [Step 1/1] [413/463] Building CXX object src/qt/CMakeFiles/bitcoin-qt-base.dir/clientmodel.cpp.o
[19:50:19] :	 [Step 1/1] [414/463] Building CXX object src/qt/CMakeFiles/bitcoin-qt-base.dir/intro.cpp.o
[19:50:19] :	 [Step 1/1] [415/463] Building CXX object src/qt/CMakeFiles/bitcoin-qt-base.dir/platformstyle.cpp.o
[19:50:19] :	 [Step 1/1] [416/463] Building CXX object src/qt/CMakeFiles/bitcoin-qt-base.dir/modaloverlay.cpp.o
[19:50:19] :	 [Step 1/1] [417/463] Building CXX object src/qt/CMakeFiles/bitcoin-qt-base.dir/qvalidatedlineedit.cpp.o
[19:50:19] :	 [Step 1/1] [418/463] Building CXX object src/qt/CMakeFiles/bitcoin-qt-base.dir/bitcoin.cpp.o
[19:50:19] :	 [Step 1/1] [419/463] Building CXX object src/qt/CMakeFiles/bitcoin-qt-base.dir/guiutil.cpp.o
[19:50:19] :	 [Step 1/1] [420/463] Building CXX object src/qt/CMakeFiles/bitcoin-qt-base.dir/qvaluecombobox.cpp.o
[19:50:19] :	 [Step 1/1] [421/463] Building CXX object src/qt/CMakeFiles/bitcoin-qt-base.dir/optionsdialog.cpp.o
[19:50:19] :	 [Step 1/1] [422/463] Building CXX object src/qt/CMakeFiles/bitcoin-qt-base.dir/bitcoingui.cpp.o
[19:50:19] :	 [Step 1/1] [423/463] Building CXX object src/qt/CMakeFiles/bitcoin-qt-base.dir/optionsmodel.cpp.o
[19:50:19] :	 [Step 1/1] [424/463] Building CXX object src/qt/CMakeFiles/bitcoin-qt-base.dir/peertablemodel.cpp.o
[19:50:19] :	 [Step 1/1] [425/463] Building CXX object src/qt/CMakeFiles/bitcoin-qt-base.dir/trafficgraphwidget.cpp.o
[19:50:19] :	 [Step 1/1] [426/463] Building CXX object src/qt/CMakeFiles/bitcoin-qt-base.dir/addressbookpage.cpp.o
[19:50:19] :	 [Step 1/1] [427/463] Building CXX object src/qt/CMakeFiles/bitcoin-qt-base.dir/coincontroltreewidget.cpp.o
[19:50:19] :	 [Step 1/1] [428/463] Building CXX object src/qt/CMakeFiles/bitcoin-qt-base.dir/utilitydialog.cpp.o
[19:50:19] :	 [Step 1/1] [429/463] Building CXX object src/qt/CMakeFiles/bitcoin-qt-base.dir/rpcconsole.cpp.o
[19:50:19] :	 [Step 1/1] [430/463] Building CXX object src/qt/CMakeFiles/bitcoin-qt-base.dir/splashscreen.cpp.o
[19:50:19] :	 [Step 1/1] [431/463] Building CXX object src/qt/CMakeFiles/bitcoin-qt-base.dir/askpassphrasedialog.cpp.o
[19:50:19] :	 [Step 1/1] [432/463] Building CXX object src/qt/CMakeFiles/bitcoin-qt-base.dir/editaddressdialog.cpp.o
[19:50:19] :	 [Step 1/1] [433/463] Building CXX object src/qt/CMakeFiles/bitcoin-qt-base.dir/addresstablemodel.cpp.o
[19:50:19] :	 [Step 1/1] [434/463] Building CXX object src/qt/CMakeFiles/bitcoin-qt-base.dir/coincontroldialog.cpp.o
[19:50:19] :	 [Step 1/1] [435/463] Building CXX object src/qt/CMakeFiles/bitcoin-qt-base.dir/openuridialog.cpp.o
[19:50:19] :	 [Step 1/1] [436/463] Building CXX object src/qt/CMakeFiles/bitcoin-qt-base.dir/overviewpage.cpp.o
[19:50:19] :	 [Step 1/1] [437/463] Building CXX object src/qt/CMakeFiles/bitcoin-qt-base.dir/receiverequestdialog.cpp.o
[19:50:19] :	 [Step 1/1] [438/463] Building CXX object src/qt/CMakeFiles/bitcoin-qt-base.dir/transactiondescdialog.cpp.o
[19:50:19] :	 [Step 1/1] [439/463] Building CXX object src/qt/CMakeFiles/bitcoin-qt-base.dir/receivecoinsdialog.cpp.o
[19:50:19] :	 [Step 1/1] [440/463] Building CXX object src/qt/CMakeFiles/bitcoin-qt-base.dir/paymentserver.cpp.o
[19:50:19] :	 [Step 1/1] [441/463] Building CXX object src/qt/CMakeFiles/bitcoin-qt-base.dir/recentrequeststablemodel.cpp.o
[19:50:19] :	 [Step 1/1] [442/463] Building CXX object src/qt/CMakeFiles/bitcoin-qt-base.dir/transactionfilterproxy.cpp.o
[19:50:19] :	 [Step 1/1] [443/463] Building CXX object src/qt/CMakeFiles/bitcoin-qt-base.dir/sendcoinsentry.cpp.o
[19:50:19] :	 [Step 1/1] [444/463] Building CXX object src/qt/CMakeFiles/bitcoin-qt-base.dir/sendcoinsdialog.cpp.o
[19:50:19] :	 [Step 1/1] [445/463] Building CXX object src/qt/CMakeFiles/bitcoin-qt-base.dir/signverifymessagedialog.cpp.o
[19:50:19] :	 [Step 1/1] [446/463] Building CXX object src/qt/CMakeFiles/bitcoin-qt-base.dir/transactionrecord.cpp.o
[19:50:19] :	 [Step 1/1] [447/463] Building CXX object src/qt/CMakeFiles/bitcoin-qt-base.dir/walletframe.cpp.o
[19:50:19] :	 [Step 1/1] [448/463] Building CXX object src/qt/CMakeFiles/bitcoin-qt-base.dir/transactiondesc.cpp.o
[19:50:19] :	 [Step 1/1] [449/463] Building CXX object src/qt/CMakeFiles/bitcoin-qt-base.dir/transactiontablemodel.cpp.o
[19:50:19] :	 [Step 1/1] [450/463] Building CXX object src/qt/CMakeFiles/bitcoin-qt-base.dir/transactionview.cpp.o
[19:50:19] :	 [Step 1/1] [451/463] Building CXX object src/qt/CMakeFiles/bitcoin-qt-base.dir/walletcontroller.cpp.o
[19:50:19] :	 [Step 1/1] [452/463] Building CXX object src/qt/CMakeFiles/bitcoin-qt-base.dir/walletmodeltransaction.cpp.o
[19:50:19] :	 [Step 1/1] [453/463] Building CXX object src/qt/CMakeFiles/bitcoin-qt-base.dir/walletmodel.cpp.o
[19:50:19] :	 [Step 1/1] [454/463] Building CXX object src/qt/CMakeFiles/bitcoin-qt-base.dir/walletview.cpp.o
[19:50:19] :	 [Step 1/1] [455/463] Building CXX object src/qt/CMakeFiles/bitcoin-qt-base.dir/paymentrequestplus.cpp.o
[19:50:19] :	 [Step 1/1] [456/463] Building CXX object src/qt/CMakeFiles/bitcoin-qt-base.dir/bitcoin-qt-base_autogen/mocs_compilation.cpp.o
[19:50:19] :	 [Step 1/1] [457/463] Building CXX object src/qt/CMakeFiles/bitcoin-qt-base.dir/qrc_bitcoin.cpp.o
[19:50:19] :	 [Step 1/1] [458/463] Building CXX object src/qt/CMakeFiles/bitcoin-qt-base.dir/qrc_bitcoin_locale.cpp.o
[19:50:19] :	 [Step 1/1] [459/463] Linking CXX static library src/qt/libbitcoin-qt-base.a
[19:50:19] :	 [Step 1/1] [460/463] Automatic MOC for target bitcoin-qt
[19:50:19] :	 [Step 1/1] [461/463] Building CXX object src/qt/CMakeFiles/bitcoin-qt.dir/bitcoin-qt_autogen/mocs_compilation.cpp.o
[19:50:19] :	 [Step 1/1] [462/463] Building CXX object src/qt/CMakeFiles/bitcoin-qt.dir/main.cpp.o
[19:50:19] :	 [Step 1/1] [463/463] Linking CXX executable src/qt/bitcoin-qt
[19:50:19] :	 [Step 1/1] ninja: error: unknown target 'test_bitcoin-seeder'
[19:50:19] :	 [Step 1/1] Build build-clang-10 failed with exit code 1
[19:50:19]W:	 [Step 1/1] Process exited with code 1
[19:50:25]E:	 [Step 1/1] Process exited with code 1 (Step: Command Line)

Snippet of first build failure:

[19:54:03] :	 [Step 1/1] [28/82] Building CXX object src/leveldb/CMakeFiles/filter_block_test.dir/table/filter_block_test.cc.o
[19:54:03] :	 [Step 1/1] [29/82] Linking CXX static library src/leveldb/libleveldb_test_base.a
[19:54:03] :	 [Step 1/1] [30/82] Linking CXX executable src/leveldb/hash_test
[19:54:03] :	 [Step 1/1] [31/82] Linking CXX executable src/leveldb/coding_test
[19:54:03] :	 [Step 1/1] [32/82] Linking CXX executable src/leveldb/bloom_test
[19:54:03] :	 [Step 1/1] [33/82] Linking CXX executable src/leveldb/skiplist_test
[19:54:03] :	 [Step 1/1] [34/82] Linking CXX executable src/leveldb/cache_test
[19:54:03] :	 [Step 1/1] [35/82] Linking CXX executable src/leveldb/filename_test
[19:54:03] :	 [Step 1/1] [36/82] Linking CXX executable src/leveldb/dbformat_test
[19:54:03] :	 [Step 1/1] [37/82] Linking CXX executable src/leveldb/log_test
[19:54:03] :	 [Step 1/1] [38/82] Linking CXX executable src/leveldb/env_test
[19:54:03] :	 [Step 1/1] [39/82] Linking CXX executable src/leveldb/env_posix_test
[19:54:03] :	 [Step 1/1] [40/82] Linking CXX executable src/leveldb/crc32c_test
[19:54:03] :	 [Step 1/1] [41/82] Linking CXX executable src/leveldb/arena_test
[19:54:03] :	 [Step 1/1] [42/82] Linking CXX executable src/leveldb/c_test
[19:54:03] :	 [Step 1/1] [43/82] Linking CXX executable src/leveldb/write_batch_test
[19:54:03] :	 [Step 1/1] [44/82] Linking CXX executable src/leveldb/version_edit_test
[19:54:03] :	 [Step 1/1] [45/82] Linking CXX executable src/leveldb/memenv_test
[19:54:03] :	 [Step 1/1] [46/82] leveldb: testing env_posix_test
[19:54:03] :	 [Step 1/1] [47/82] Linking CXX executable src/leveldb/db_test
[19:54:03] :	 [Step 1/1] [48/82] Linking CXX executable src/leveldb/table_test
[19:54:03] :	 [Step 1/1] [49/82] Linking CXX executable src/leveldb/autocompact_test
[19:54:03] :	 [Step 1/1] [50/82] Linking CXX executable src/leveldb/recovery_test
[19:54:03] :	 [Step 1/1] [51/82] leveldb: testing cache_test
[19:54:03] :	 [Step 1/1] [52/82] Linking CXX executable src/leveldb/corruption_test
[19:54:03] :	 [Step 1/1] [53/82] Linking CXX executable src/leveldb/version_set_test
[19:54:03] :	 [Step 1/1] [54/82] leveldb: testing dbformat_test
[19:54:03] :	 [Step 1/1] [55/82] Linking CXX executable src/leveldb/filter_block_test
[19:54:03] :	 [Step 1/1] [56/82] Linking CXX executable src/leveldb/fault_injection_test
[19:54:03] :	 [Step 1/1] [57/82] leveldb: testing version_edit_test
[19:54:03] :	 [Step 1/1] [58/82] leveldb: testing memenv_test
[19:54:03] :	 [Step 1/1] [59/82] leveldb: testing hash_test
[19:54:03] :	 [Step 1/1] [60/82] Linking CXX executable src/leveldb/issue200_test
[19:54:03] :	 [Step 1/1] [61/82] leveldb: testing filename_test
[19:54:03] :	 [Step 1/1] [62/82] Linking CXX executable src/leveldb/issue178_test
[19:54:03] :	 [Step 1/1] [63/82] leveldb: testing crc32c_test
[19:54:03] :	 [Step 1/1] [64/82] leveldb: testing coding_test
[19:54:03] :	 [Step 1/1] [65/82] leveldb: testing issue200_test
[19:54:03] :	 [Step 1/1] [66/82] leveldb: testing bloom_test
[19:54:03] :	 [Step 1/1] [67/82] leveldb: testing filter_block_test
[19:54:03] :	 [Step 1/1] [68/82] leveldb: testing write_batch_test
[19:54:03] :	 [Step 1/1] [69/82] leveldb: testing version_set_test
[19:54:03] :	 [Step 1/1] [70/82] leveldb: testing c_test
[19:54:03] :	 [Step 1/1] [71/82] leveldb: testing recovery_test
[19:54:03] :	 [Step 1/1] [72/82] leveldb: testing log_test
[19:54:03] :	 [Step 1/1] [73/82] leveldb: testing env_test
[19:54:03] :	 [Step 1/1] [74/82] leveldb: testing corruption_test
[19:54:03] :	 [Step 1/1] [75/82] leveldb: testing fault_injection_test
[19:54:03] :	 [Step 1/1] [76/82] leveldb: testing skiplist_test
[19:54:03] :	 [Step 1/1] [77/82] leveldb: testing arena_test
[19:54:03] :	 [Step 1/1] [78/82] leveldb: testing table_test
[19:54:03] :	 [Step 1/1] [79/82] leveldb: testing issue178_test
[19:54:03] :	 [Step 1/1] [80/82] leveldb: testing autocompact_test
[19:54:03] :	 [Step 1/1] [81/82] leveldb: testing db_test
[19:54:03] :	 [Step 1/1] [82/82] Running leveldb test suite
[19:54:03] :	 [Step 1/1] PASSED: leveldb test suite
[19:54:03] :	 [Step 1/1] ninja: error: unknown target 'check-bitcoin-seeder'
[19:54:03] :	 [Step 1/1] Build build-diff failed with exit code 1
[19:54:03]W:	 [Step 1/1] Process exited with code 1
[19:54:20]E:	 [Step 1/1] Process exited with code 1 (Step: Command Line)
Fabien requested changes to this revision.Mon, Jun 29, 06:39
Fabien added a subscriber: Fabien.

Please keep the targets renaming for another diff as there are some places where this needs to be updated as well.

src/seeder/test/CMakeLists.txt
22 ↗(On Diff #21834)

bizare => bizarre, makign => making

This revision now requires changes to proceed.Mon, Jun 29, 06:39
Fabien added a comment.Mon, Jun 29, 07:31

If you rebase on top of D6763 you only have a single occurrence of the seeder target remaining in contrib/teamcity/builds/build-osx.sh

deadalnix updated this revision to Diff 21841.Mon, Jun 29, 11:08

Update test suite name in various places

deadalnix updated this revision to Diff 21842.Mon, Jun 29, 11:18

Also rename variosu instances of test_bitcoin-seeder

Fabien accepted this revision.Mon, Jun 29, 11:20
This revision is now accepted and ready to land.Mon, Jun 29, 11:20
This revision was landed with ongoing or failed builds.Mon, Jun 29, 11:20
This revision was automatically updated to reflect the committed changes.

Snippet of first build failure:

[11:34:26] :	 [Step 1/1] [420/463] Building CXX object src/qt/CMakeFiles/bitcoin-qt-base.dir/bitcoingui.cpp.o
[11:34:26] :	 [Step 1/1] [421/463] Building CXX object src/qt/CMakeFiles/bitcoin-qt-base.dir/optionsdialog.cpp.o
[11:34:26] :	 [Step 1/1] [422/463] Linking CXX executable src/bench/bitcoin-bench
[11:34:26] :	 [Step 1/1] [423/463] Building CXX object src/qt/CMakeFiles/bitcoin-qt-base.dir/peertablemodel.cpp.o
[11:34:26] :	 [Step 1/1] [424/463] Building CXX object src/qt/CMakeFiles/bitcoin-qt-base.dir/optionsmodel.cpp.o
[11:34:26] :	 [Step 1/1] [425/463] Building CXX object src/qt/CMakeFiles/bitcoin-qt-base.dir/guiutil.cpp.o
[11:34:26] :	 [Step 1/1] [426/463] Building CXX object src/qt/CMakeFiles/bitcoin-qt-base.dir/coincontroltreewidget.cpp.o
[11:34:26] :	 [Step 1/1] [427/463] Building CXX object src/qt/CMakeFiles/bitcoin-qt-base.dir/trafficgraphwidget.cpp.o
[11:34:26] :	 [Step 1/1] [428/463] Building CXX object src/qt/CMakeFiles/bitcoin-qt-base.dir/editaddressdialog.cpp.o
[11:34:26] :	 [Step 1/1] [429/463] Building CXX object src/qt/CMakeFiles/bitcoin-qt-base.dir/addressbookpage.cpp.o
[11:34:26] :	 [Step 1/1] [430/463] Building CXX object src/qt/CMakeFiles/bitcoin-qt-base.dir/utilitydialog.cpp.o
[11:34:26] :	 [Step 1/1] [431/463] Building CXX object src/qt/CMakeFiles/bitcoin-qt-base.dir/splashscreen.cpp.o
[11:34:26] :	 [Step 1/1] [432/463] Building CXX object src/qt/CMakeFiles/bitcoin-qt-base.dir/askpassphrasedialog.cpp.o
[11:34:26] :	 [Step 1/1] [433/463] Building CXX object src/qt/CMakeFiles/bitcoin-qt-base.dir/openuridialog.cpp.o
[11:34:26] :	 [Step 1/1] [434/463] Building CXX object src/qt/CMakeFiles/bitcoin-qt-base.dir/overviewpage.cpp.o
[11:34:26] :	 [Step 1/1] [435/463] Building CXX object src/qt/CMakeFiles/bitcoin-qt-base.dir/addresstablemodel.cpp.o
[11:34:26] :	 [Step 1/1] [436/463] Building CXX object src/qt/CMakeFiles/bitcoin-qt-base.dir/qrc_bitcoin_locale.cpp.o
[11:34:26] :	 [Step 1/1] [437/463] Building CXX object src/qt/CMakeFiles/bitcoin-qt-base.dir/receiverequestdialog.cpp.o
[11:34:26] :	 [Step 1/1] [438/463] Building CXX object src/qt/CMakeFiles/bitcoin-qt-base.dir/transactiondescdialog.cpp.o
[11:34:26] :	 [Step 1/1] [439/463] Building CXX object src/qt/CMakeFiles/bitcoin-qt-base.dir/sendcoinsentry.cpp.o
[11:34:26] :	 [Step 1/1] [440/463] Building CXX object src/qt/CMakeFiles/bitcoin-qt-base.dir/transactionfilterproxy.cpp.o
[11:34:26] :	 [Step 1/1] [441/463] Building CXX object src/qt/CMakeFiles/bitcoin-qt-base.dir/recentrequeststablemodel.cpp.o
[11:34:26] :	 [Step 1/1] [442/463] Building CXX object src/qt/CMakeFiles/bitcoin-qt-base.dir/coincontroldialog.cpp.o
[11:34:26] :	 [Step 1/1] [443/463] Building CXX object src/qt/CMakeFiles/bitcoin-qt-base.dir/receivecoinsdialog.cpp.o
[11:34:26] :	 [Step 1/1] [444/463] Building CXX object src/qt/CMakeFiles/bitcoin-qt-base.dir/rpcconsole.cpp.o
[11:34:26] :	 [Step 1/1] [445/463] Building CXX object src/qt/CMakeFiles/bitcoin-qt-base.dir/paymentserver.cpp.o
[11:34:26] :	 [Step 1/1] [446/463] Building CXX object src/qt/CMakeFiles/bitcoin-qt-base.dir/transactionrecord.cpp.o
[11:34:26] :	 [Step 1/1] [447/463] Building CXX object src/qt/CMakeFiles/bitcoin-qt-base.dir/signverifymessagedialog.cpp.o
[11:34:26] :	 [Step 1/1] [448/463] Building CXX object src/qt/CMakeFiles/bitcoin-qt-base.dir/transactiondesc.cpp.o
[11:34:26] :	 [Step 1/1] [449/463] Building CXX object src/qt/CMakeFiles/bitcoin-qt-base.dir/walletmodeltransaction.cpp.o
[11:34:26] :	 [Step 1/1] [450/463] Building CXX object src/qt/CMakeFiles/bitcoin-qt-base.dir/walletframe.cpp.o
[11:34:26] :	 [Step 1/1] [451/463] Building CXX object src/qt/CMakeFiles/bitcoin-qt-base.dir/transactiontablemodel.cpp.o
[11:34:26] :	 [Step 1/1] [452/463] Building CXX object src/qt/CMakeFiles/bitcoin-qt-base.dir/transactionview.cpp.o
[11:34:26] :	 [Step 1/1] [453/463] Building CXX object src/qt/CMakeFiles/bitcoin-qt-base.dir/sendcoinsdialog.cpp.o
[11:34:26] :	 [Step 1/1] [454/463] Building CXX object src/qt/CMakeFiles/bitcoin-qt-base.dir/paymentrequestplus.cpp.o
[11:34:26] :	 [Step 1/1] [455/463] Building CXX object src/qt/CMakeFiles/bitcoin-qt-base.dir/walletcontroller.cpp.o
[11:34:26] :	 [Step 1/1] [456/463] Building CXX object src/qt/CMakeFiles/bitcoin-qt-base.dir/walletview.cpp.o
[11:34:29] :	 [Step 1/1] Publishing artifacts (18s)
[11:34:29] :		 [Publishing artifacts] Collecting files to publish: [+:results/artifacts=>artifacts.tar.gz]
[11:34:29] :		 [Publishing artifacts] Creating archive artifacts.tar.gz (12s)
[11:34:29] :			 [Creating archive artifacts.tar.gz] Creating /home/teamcity/buildAgent/temp/buildTmp/TarPreprocessor859580782599570423/artifacts.tar.gz
[11:34:29]W:	 [Step 1/1] cp: cannot stat '/tmp/sanitizer_logs': No such file or directory
[11:34:29]W:	 [Step 1/1] cp: cannot stat '/work/build-clang-10': No such file or directory
[11:34:30]W:	 [Step 1/1] cp: cannot stat '/work/ibd/debug.log': No such file or directory
[11:34:42] :			 [Creating archive artifacts.tar.gz] Archive was created, file size 127.11 MB (133293480 bytes)
[11:34:42] :		 [Publishing artifacts] Publishing 1 file using [WebPublisher]: results/artifacts => artifacts.tar.gz
[11:34:42] :		 [Publishing artifacts] Publishing 1 file using [ArtifactsCachePublisher]: results/artifacts => artifacts.tar.gz
[11:34:29] :	 [Step 1/1] [457/463] Building CXX object src/qt/CMakeFiles/bitcoin-qt-base.dir/walletmodel.cpp.o
[11:34:29]i:	 [Step 1/1] ##teamcity[publishArtifacts '+:results/artifacts=>artifacts.tar.gz']
[11:34:42] :	 [Step 1/1] 
[11:34:42] :	 [Step 1/1] [458/463] Building CXX object src/qt/CMakeFiles/bitcoin-qt-base.dir/bitcoin-qt-base_autogen/mocs_compilation.cpp.o
[11:34:42] :	 [Step 1/1] [459/463] Linking CXX static library src/qt/libbitcoin-qt-base.a
[11:34:42] :	 [Step 1/1] [460/463] Automatic MOC for target bitcoin-qt
[11:34:42] :	 [Step 1/1] [461/463] Building CXX object src/qt/CMakeFiles/bitcoin-qt.dir/bitcoin-qt_autogen/mocs_compilation.cpp.o
[11:34:42] :	 [Step 1/1] [462/463] Building CXX object src/qt/CMakeFiles/bitcoin-qt.dir/main.cpp.o
[11:34:42] :	 [Step 1/1] [463/463] Linking CXX executable src/qt/bitcoin-qt
[11:34:42] :	 [Step 1/1] ninja: error: unknown target 'test_bitcoin-seeder'
[11:34:42] :	 [Step 1/1] Build build-clang-10 failed with exit code 1
[11:34:42]W:	 [Step 1/1] Process exited with code 1
[11:34:47]E:	 [Step 1/1] Process exited with code 1 (Step: Command Line)